{"text_format":"1","workbook":"xlsx","n_sheets":4,"sheets":["Inputs","Simulador","Tabelas","Disclaimer"],"not_rendered":{"charts":0,"images":2,"macros":0,"external_links":0,"defined_names":126,"comments":0,"pivot_tables":0},"unopened":[],"bounds":{"document_bytes":16777216,"sheet_cells":100000,"rows_first":2000,"rows_last":500,"rows_between":2000,"halvings":0,"cell_chars":16384,"cell_head_chars":4096},"cells_cut":0,"cells_raw":0,"read":"whole","date_system":"1900"}

{"sheet":"Inputs","index":0,"n_rows":13,"n_cols":251,"rows_kept":13,"cut":false,"hidden":true,"merged":[]}
[null,null,null,null,null,null,null,null,null,null,null,null,null,null,null,null,null,null,null,null,null,null,null,null,null,null,null,null,null,null,null,null,null,null,null,null,null,null,null,null,null,null,null,"Tier-1 Capital"]
[null,null,null,null,null,null,null,null,null,null,null,null,null,null,null,null,null,null,null,null,null,null,null,null,null,null,null,null,null,null,null,null,null,null,null,null,null,null,null,null,null,null,null,"Upper Tier-2 Capital"]
[null,null,null,null,null,null,null,null,null,null,null,null,null,null,null,null,null,null,null,null,null,null,null,"Data da última actualização",null,null,null,null,null,null,null,null,null,null,null,null,null,null,null,null,null,null,null,"Lower Tier-2 Capital"]
[null,null,null,null,null,null,null,null,null,null,null,null,null,null,null,null,null,null,null,null,null,null,null,{"$f":"+NOW()","v":"2026-04-09T09:42:08.520"},null,null,null,null,null,null,null,null,null,null,null,null,null,null,null,null,null,null,null,"Senior"]
[null,null,null,null,null,null,null,null,null,null,null,null,null,null,null,null,null,null,null,null,null,null,null,null,null,null,null,null,null,null,null,null,null,null,null,null,null,null,null,null,null,null,null,"Covered"]
[]
[]
[null,null,null,null,null,null,null,null,null,null,null,null,null,null,null,null,null,null,null,null,null,null,null,null,null,null,null,null,null,null,null,null,null,null,null,"1 5/8",null,null,null,null,null,null,null,null,null,null,null,null,null,null,null,null,null,null,null,{"$f":"+MIN(Table3[SETTLE_DT])*1-1","v":"2026-04-28"},null,"Accrual Date",null,null,null,null,null,null,null,null,null,null,"conv ratio",null,null,null,null,null,null,null,null,null,null,null,{"$f":"+SMALL(($CC$13:$HK$13),COUNTIF($CC$13:$HK$13,0)+1)","v":"2026-10-29"},{"$f":"MATCH(CouponChecker,Table3[DES_CASH_FLOW],0)+ROW(Table3[[#Headers],[DES_CASH_FLOW]])","v":13}]
[]
[null,"SECURITY_NAME","Short_NAME","CRNCY","PX_ASK","CHG_PCT_1D","CHG_PCT_YTD","PX_BID","PX_ASK","YLD_YTC_ASK","YLD_TRUE_GROSS_ASK","CPN","Nxt_call_dt","FINAL_MATURITY","NXT_CALL_PX","STRUCTURED_NOTE_CPN_FORMULA",null,"DUR_ADJ_MID","YAS_ZSPREAD","MIN_PIECE","AMT_ISSUED_MMM",null,"RTG_SP","use_of_proceeds","  ISIN  ","COUNTRY_FULL_NAME","CNTRY_OF_RISK",null,"RTG_SP","RTG_MOODY","RTG_FITCH","RTG_SP_LT_LC_ISSUER_CREDIT",null,null,null,null,null,null,null,null,null,null,null,null,null,null,null,null,null,null,null,"EXTENDIBLE_IS_STILL_EXTENDIBLE",null,null,null,null,null,null,null,null,null,null,null,null,"CPN_FREQ"]
{"$rows_left_out":4}
{"sheet":"Simulador","index":1,"n_rows":323,"n_cols":36,"rows_kept":323,"cut":false,"hidden":false,"merged":[[21,4,21,5],[311,1,311,8],[312,1,312,8],[307,1,307,8],[23,4,25,8],[306,1,306,8],[308,1,308,8],[309,1,309,8],[310,1,310,8]]}
[null,null,null,null,null,null,null,null,null,null,{"$f":"+MATCH(IsinSelected,Table3[ISIN],0)","v":1},"YTM Bruta",{"$f":"+TRANSPOSE(E15:F15)","v":"Periodicidade:"},null,null,null,0,1,2,3]
[null,null,null,null,null,null,null,null,{"$f":"TODAY()","v":"2026-04-09"},null,null,{"$f":"+IF(E10<>\"\",\"YTC Bruta\",\"\")","v":""},"Semestral",null,null,null,"Primário","Prime Brokerage","Prime Brokerage","Colocação",null,null,null,"Prime Brokerage",{"$f":"IFERROR(INDEX($Q$3:$U$3,SMALL(IF($Q$2:$U$2=Tipo_de_Corretagem,COLUMN($Q$3:$U$3)-MIN(COLUMN($Q$3:$U$3))+1,\"\"),ROW(A1))),\"\")","v":"Sala de Mercados"}]
[null,null,null,null,null,null,null,null,null,null,null,null,{"$f":"+INDEX(Tabelas!I4:I13,MATCH(M2,Tabelas!J4:J13,0))","v":2},null,null,"Plataformas_Negociacao","Sala de Mercados","Euronext Lisboa","Sala de Mercados","Sala de Mercados",null,null,null,"Primário",{"$f":"IFERROR(INDEX($Q$3:$U$3,SMALL(IF($Q$2:$U$2=Tipo_de_Corretagem,COLUMN($Q$3:$U$3)-MIN(COLUMN($Q$3:$U$3))+1,\"\"),ROW(A2))),\"\")","v":""}]
[null,null,null,null,null,null,null,null,null,null,null,null,null,null,null,null,null,null,null,null,null,null,null,"Colocação",{"$f":"IFERROR(INDEX($Q$3:$T$3,SMALL(IF($Q$2:$T$2=Tipo_de_Corretagem,COLUMN($Q$3:$T$3)-MIN(COLUMN($Q$3:$T$3))+1,\"\"),ROW(A3))),\"\")","v":""}]
[null,null,{"$f":"+IF(Simulador!$C$6=\"Government\",7,8)","v":8}]
[null,"Tipo de Obrigação","Corporate",null,"Tipo de Colateral",{"$f":"+INDEX(Table3[Tipo de Colateral],tbl_row)","v":"Senior"},null,"Issued",40000000,null,null,null,null,"ATENÇÃO",{"$f":"OFFSET(Q6,0,SUMPRODUCT(--($Q$2:$U$2=Tipo_de_Corretagem),--($Q$3:$U$3=PlataformaNegociacao),$Q$1:$U$1))*0","v":0},{"$f":"+H12","v":"Comissão Compra"},2E-3,2.5000000000000001E-3,{"$f":"+IF(ABS(F35)<25000,0.4%,IF(AND(ABS(F35)>=25000,ABS(F35)<100000),0.3%,0.2%))","v":4.0000000000000001E-3},0]
[null,"País","PORTUGAL",null,"Tipo Maturidade",{"$f":"+INDEX(Table3[Maturity Type],tbl_row)","v":"AT MATURITY"},null,"Modalidade","Subscrição",null,null,null,null,"ATENÇÃO",{"$f":"OFFSET(Q7,0,SUMPRODUCT(--($Q$2:$U$2=Tipo_de_Corretagem),--($Q$3:$U$3=PlataformaNegociacao),$Q$1:$U$1))*0","v":0},"Mín. Com. Compra",5,30,35,0]
[null,"Bond","Benfica 2026-2031",null,{"$f":"IF(F8=\"\",\"\",\"Ranking Pagamento\")","v":""},{"$f":"+INDEX(Table3[PAYMENT_RANK],tbl_row)","v":""},null,"Tipo Corretagem:","Colocação",null,null,null,null,"ATENÇÃO",{"$f":"OFFSET(Q8,0,SUMPRODUCT(--($Q$2:$U$2=Tipo_de_Corretagem),--($Q$3:$U$3=PlataformaNegociacao),$Q$1:$U$1))","v":0.02},"Comissão Juros",0.02,0.02,0.02,0.02,null,null,null,"Subscrição"]
[null,null,null,null,{"$f":"IF(F9=0,\"\",\"Rating\")","v":""},{"$f":"+INDEX(Table3[Rating],tbl_row)","v":0},null,"IRS","Continente",null,null,null,null,"ATENÇÃO",5,"Mín. Com. Juros",5,5,5,5,null,null,null,"Troca PTSLBNOM0007"]
[null,null,null,null,{"$f":"IF(G10=\"Y\",\"Call Date\",IF(F7=\"CONV/PUT\",\"Put Date\",\"\"))","v":""},{"$f":"+IF(E10=\"\",\"\",INDEX(Table3[Call/Put Date],tbl_row)*1)","v":""},{"$f":"+INDEX(Table3[CALLABLE],tbl_row)","v":false},"IRS (taxa)",{"$f":"INDEX(Q18:Q20,MATCH(PlataformaNegociacao,P18:P20,0))","v":0.28000000000000003},null,null,null,null,"ATENÇÃO",2E-3,"Comissão Reemb.",2E-3,2E-3,2E-3,2E-3]
{"$rows_left_out":314}
{"sheet":"Tabelas","index":2,"n_rows":2004,"n_cols":36,"rows_kept":2004,"cut":false,"hidden":true,"merged":[[0,22,2,22]]}
[null,null,null,{"$f":"\"D5:D\"&ROWS(CUPAO)+4","v":"D5:D374"},null,null,null,null,null,null,null,null,null,null,null,null,null,null,null,null,null,null,"Feriados Target"]
[null,null,null,null,null,null,null,null,null,null,null,null,null,null,null,null,null,null,null,null,null,null,null,null,null,null,"BrockerNamesConvertion",null,null,null,"table3 ","SecuritiesOutsideSimulator","NotesSifox",null,null,"NotMeant"]
["countUnique","BondType","Country","Bonds",null,null,"qryCountry",null,"Meses","Periodicidade",null,null,"Convenções",null,null,null,"Emitentes",null,null,null,null,null,null,null,null,null,"DB","DAB",null,null,{"$f":"IF(ISNUMBER(MATCH(AF3,Table3[ISIN],0)),MATCH(AF3,Table3[ISIN],0))","v":false},"XS0720589174",{"$f":"+INDEX(Called_Check_Isin,LARGE((471518=#REF!)*ROW(#REF!),ROWS(AG$3:AG3)))","v":{"$error":"#REF!"}},null,null,45979]
[{"$f":"SUMPRODUCT((qryCountry<>\"\")/COUNTIF(qryCountry,qryCountry&\"\"))","v":1},"Corporate",{"$f":"+IF(ROWS($C$4:C4)>countUnique,\"\",INDEX(qryCountry,SMALL(IF(FREQUENCY(IF(qryCountry<>\"\",MATCH(qryCountry,qryCountry&\"\",0)),ROW(qryCountry)-ROW($G$4)+1),ROW(qryCountry)-ROW($G$4)+1),ROW()-ROW($C$4)+1)))","v":"PORTUGAL"},{"$f":"IF(NOT(ISERROR(INDEX(IF(Descricao__1<>\"\",Descricao__1,\"\"),SMALL(IF(Simulador!$C$7=\"\",1,IF(Simulador!$C$7=CNTRY_OF_RISK,1,999))*IF(Simulador!$C$6=\"\",1,IF(Simulador!$C$5=MARKET_SECTOR,1,999))*(ROW(INDIRECT(D1))-ROW(D5)+1),(ROW(INDIRECT(D1))-ROW(D5)+1))))),INDEX(IF(Descricao__1<>\"\",Descricao__1,\"\"),SMALL(IF(Simulador!$C$7=\"\",1,IF(Simulador!$C$7=CNTRY_OF_RISK,1,999))*IF(Simulador!$C$6=\"\",1,IF(Simulador!$C$5=MARKET_SECTOR,1,999))*(ROW(INDIRECT(D1))-ROW(D5)+1),(ROW(INDIRECT(D1))-ROW(D5)+1))),\"\")","v":"Benfica 2026-2031"},{"$f":"+OFFSET($C$4,,,COUNTA($C$4:$C$64)-COUNTIF($C$4:$C$64,\"\"))","v":"PORTUGAL"},null,{"$f":"+IF(Inputs!$BC$13:$BC$9140=Simulador!$C$5,Inputs!$AA$13:$AA$9140,\"\")","v":"PORTUGAL"},null,1,"Anual",{"$f":"+I4","v":1},5,"30/360",4,null,null,"AUSTRALIAN GOVERNMENT","GOVERNO AUSTRALIANO",null,null,null,null,"2005-03-25",null,null,null,"ZKB","ZKB",null,null,{"$f":"IF(ISNUMBER(MATCH(AF4,Table3[ISIN],0)),MATCH(AF4,Table3[ISIN],0))","v":false},"US46556MAK80",{"$f":"+INDEX(Called_Check_Isin,LARGE((471518=#REF!)*ROW(#REF!),ROWS(AG$3:AG4)))","v":{"$error":"#REF!"}},null,null,47240]
[null,"Government",{"$f":"+IF(ROWS($C$4:C5)>countUnique,\"\",INDEX(qryCountry,SMALL(IF(FREQUENCY(IF(qryCountry<>\"\",MATCH(qryCountry,qryCountry&\"\",0)),ROW(qryCountry)-ROW($G$4)+1),ROW(qryCountry)-ROW($G$4)+1),ROW()-ROW($C$4)+1)))","v":""},"",null,null,"",null,2,"Semestral",2,14,"30/360 NON-EOM",4,null,null,"LAND BERLIN","LAND BERLIN",null,null,null,null,"2005-03-28",null,null,null,"NOM","NOMX",null,null,{"$f":"IF(ISNUMBER(MATCH(AF5,Table3[ISIN],0)),MATCH(AF5,Table3[ISIN],0))","v":false},"XS0365923977",{"$f":"+INDEX(Called_Check_Isin,LARGE((471518=#REF!)*ROW(#REF!),ROWS(AG$3:AG5)))","v":{"$error":"#REF!"}},null,null,100514]
[null,null,{"$f":"+IF(ROWS($C$4:C6)>countUnique,\"\",INDEX(qryCountry,SMALL(IF(FREQUENCY(IF(qryCountry<>\"\",MATCH(qryCountry,qryCountry&\"\",0)),ROW(qryCountry)-ROW($G$4)+1),ROW(qryCountry)-ROW($G$4)+1),ROW()-ROW($C$4)+1)))","v":""},"",null,null,"",null,3,"Quadrimestral",3,6,"30/365",null,null,null,"BPE FINANCIACIONES SA","BPE FINANCIACIONES SA",null,null,null,null,"2005-05-01",null,null,null,"HVB","HVB",null,null,{"$f":"IF(ISNUMBER(MATCH(AF6,Table3[ISIN],0)),MATCH(AF6,Table3[ISIN],0))","v":false},"DE000A1TNA39",{"$f":"+INDEX(Called_Check_Isin,LARGE((471518=#REF!)*ROW(#REF!),ROWS(AG$3:AG6)))","v":{"$error":"#REF!"}},null,null,101514]
[null,null,{"$f":"+IF(ROWS($C$4:C7)>countUnique,\"\",INDEX(qryCountry,SMALL(IF(FREQUENCY(IF(qryCountry<>\"\",MATCH(qryCountry,qryCountry&\"\",0)),ROW(qryCountry)-ROW($G$4)+1),ROW(qryCountry)-ROW($G$4)+1),ROW()-ROW($C$4)+1)))","v":""},"",null,null,"",null,4,"Trimestral",4,15,"30/365 NON-EOM",null,null,null,"BUNDESSCHATZANWEISUNGEN","TESOURARIA REPÚBLICA FEDERAL ALEMÃ",null,null,null,null,"2005-12-25",null,null,null,"RBSM","RBSM",null,null,{"$f":"IF(ISNUMBER(MATCH(AF7,Table3[ISIN],0)),MATCH(AF7,Table3[ISIN],0))","v":false},"PTMOCQOE0006",{"$f":"+INDEX(Called_Check_Isin,LARGE((471518=#REF!)*ROW(#REF!),ROWS(AG$3:AG7)))","v":{"$error":"#REF!"}},null,null,102514]
[null,null,{"$f":"+IF(ROWS($C$4:C8)>countUnique,\"\",INDEX(qryCountry,SMALL(IF(FREQUENCY(IF(qryCountry<>\"\",MATCH(qryCountry,qryCountry&\"\",0)),ROW(qryCountry)-ROW($G$4)+1),ROW(qryCountry)-ROW($G$4)+1),ROW()-ROW($C$4)+1)))","v":""},"",null,null,"",null,12,"Mensal",12,4,"30/ACT",null,null,null,"FED REPUBLIC OF BRAZIL","REPÚBLICA FEDERATIVA DO BRASIL",null,null,null,null,"2005-12-26",null,null,null,"EBNP","EBNP",null,null,{"$f":"IF(ISNUMBER(MATCH(AF8,Table3[ISIN],0)),MATCH(AF8,Table3[ISIN],0))","v":false},"PTOTENOE0018",{"$f":"+INDEX(Called_Check_Isin,LARGE((471518=#REF!)*ROW(#REF!),ROWS(AG$3:AG8)))","v":{"$error":"#REF!"}},null,null,103514]
[null,null,{"$f":"+IF(ROWS($C$4:C9)>countUnique,\"\",INDEX(qryCountry,SMALL(IF(FREQUENCY(IF(qryCountry<>\"\",MATCH(qryCountry,qryCountry&\"\",0)),ROW(qryCountry)-ROW($G$4)+1),ROW(qryCountry)-ROW($G$4)+1),ROW()-ROW($C$4)+1)))","v":""},"",null,null,"",null,null,null,null,13,"30/ACT NON-EOM",null,null,null,"REPUBLIC OF CYPRUS","REPÚBLICA DE CHIPRE",null,null,null,null,"2006-01-01",null,null,null,"BMLX","BMLX",null,null,{"$f":"IF(ISNUMBER(MATCH(AF9,Table3[ISIN],0)),MATCH(AF9,Table3[ISIN],0))","v":false},"XS1136802615",{"$f":"+INDEX(Called_Check_Isin,LARGE((471518=#REF!)*ROW(#REF!),ROWS(AG$3:AG9)))","v":{"$error":"#REF!"}},null,null,203507]
[null,null,{"$f":"+IF(ROWS($C$4:C10)>countUnique,\"\",INDEX(qryCountry,SMALL(IF(FREQUENCY(IF(qryCountry<>\"\",MATCH(qryCountry,qryCountry&\"\",0)),ROW(qryCountry)-ROW($G$4)+1),ROW(qryCountry)-ROW($G$4)+1),ROW()-ROW($C$4)+1)))","v":""},"",null,null,"",null,null,null,null,2,"ACT/360",2,null,null,"BUNDESREPUB. DEUTSCHLAND","REPÚBLICA FEDERAL ALEMÃ",null,null,null,null,"2006-04-14",null,null,null,"BAME","BAME",null,null,{"$f":"IF(ISNUMBER(MATCH(AF10,Table3[ISIN],0)),MATCH(AF10,Table3[ISIN],0))","v":false},"DE0001135358",{"$f":"+INDEX(Called_Check_Isin,LARGE((471518=#REF!)*ROW(#REF!),ROWS(AG$3:AG10)))","v":{"$error":"#REF!"}},null,null,275481]
{"$rows_left_out":1995}
{"sheet":"Disclaimer","index":3,"n_rows":11,"n_cols":2,"rows_kept":11,"cut":false,"hidden":false,"merged":[[18,1,18,16],[19,1,19,16],[20,1,20,16],[10,1,10,16],[13,1,13,16],[14,1,14,16],[15,1,15,16],[16,1,16,16],[17,1,17,16],[9,1,9,16],[4,1,4,16],[5,1,5,16],[6,1,6,16],[7,1,7,16],[8,1,8,16]]}
[]
[]
[null,"Disclaimer"]
[]
[null,"O presente documento é privado e confidencial, tendo sido preparado pelo Banco Invest, S.A. (“Banco Invest”). "]
[null,"A informação contida neste documento tem carácter meramente informativo, sendo divulgada como mera ferramenta de apoio, não podendo desencadear, ou justificar, qualquer acção ou omissão, sustentar qualquer operação, nem substituir qualquer aferição ou julgamento próprios dos destinatários, sendo estes inteiramente responsáveis pelos actos e omissões que adoptem, bem como por toda e qualquer operação efectivada e relacionada, ainda que indirecta e remotamente, com o conteúdo do presente documento. "]
[null,"Adverte-se, igualmente, os destinatários para o facto de este documento ter sido elaborado utilizando informação económica e financeira disponível ao público, e considerada fidedigna, não garantindo o Banco Invest a sua total precisão, sendo o seu conteúdo e as respectivas fontes susceptíveis de alteração em função de um qualquer factor que modifique os pressupostos que serviram de base à apresentação dos mesmos."]
[null,"O Banco Invest não assume, assim, qualquer responsabilidade por quaisquer eventuais danos ou prejuízos resultantes, directa ou indirectamente da utilização da informação referida neste documento, independentemente da forma ou natureza que possam vir a revestir."]
[null,"Mais se adverte que a presente informação não foi elaborada com nenhum objectivo específico e concreto de investimento, não assumindo o Banco Invest qualquer obrigação de resultado."]
[null,"Ademais, declara-se não existirem quaisquer situações de conflitos de interesses tendo por objecto, por um lado, o título e/ou emitente a que se reporta o presente documento e, por outro lado, o autor do presente documento ou o Banco Invest. O Banco Invest, ou os seus colaboradores, poderão deter, a qualquer momento, uma posição sujeita a alterações, em qualquer título referido neste documento."]
{"$rows_left_out":1}